Reaction Details
TargetLysosomal Pro-X carboxypeptidase
LigandBDBM50364670
Substrate/Competitorn/a
Meas. Tech.ChEMBL_802882 (CHEMBL1953700)
IC50 17±n/a nM
Citation Shen, HCDing, FXJiang, JVerras, AChabin, RMXu, STong, XChen, QXie, DLassman, MEBhatt, URGarcia-Calvo, MMGeissler, WShen, ZMurphy, BAGorski, JNWiltsie, JSinhaRoy, RHale, JJPinto, SShen, DM Discovery of benzodihydroisofurans as novel, potent, bioavailable and brain-penetrant prolylcarboxypeptidase inhibitors. Bioorg Med Chem Lett22:1550-6 (2012) 
 
Lysosomal Pro-X carboxypeptidase
Name:Lysosomal Pro-X carboxypeptidase
Type:PROTEIN
Mol. Mass.:55028.96
Organism:Mus musculus
Description:ChEMBL_1335505
Residue:491
BDBM50364670
NameBDBM50364670
Synonyms:CHEMBL1951459
TypeSmall organic molecule
Emp. Form.C28H29Cl2N3O
Mol. Mass.494.455
SMILESClc1cc(Cl)cc(c1)C1OC2(CCN(Cc3ccc(cn3)N3CCCC3)CC2)c2ccccc12