Reaction Details
TargetLysosomal Pro-X carboxypeptidase
LigandBDBM50364680
Substrate/Competitorn/a
Meas. Tech.ChEMBL_802882 (CHEMBL1953700)
IC50 5.8±n/a nM
Citation Shen, HCDing, FXJiang, JVerras, AChabin, RMXu, STong, XChen, QXie, DLassman, MEBhatt, URGarcia-Calvo, MMGeissler, WShen, ZMurphy, BAGorski, JNWiltsie, JSinhaRoy, RHale, JJPinto, SShen, DM Discovery of benzodihydroisofurans as novel, potent, bioavailable and brain-penetrant prolylcarboxypeptidase inhibitors. Bioorg Med Chem Lett22:1550-6 (2012) 
 
Lysosomal Pro-X carboxypeptidase
Name:Lysosomal Pro-X carboxypeptidase
Type:PROTEIN
Mol. Mass.:55028.96
Organism:Mus musculus
Description:ChEMBL_1335505
Residue:491
BDBM50364680
NameBDBM50364680
Synonyms:CHEMBL1951469
TypeSmall organic molecule
Emp. Form.C24H21ClF3N3O2
Mol. Mass.475.891
SMILESFC(F)(F)Oc1ccc(CN2CCC3(CC2)OC(c2cccnc32)c2cc(Cl)ccn2)cc1