Reaction Details
TargetLysosomal Pro-X carboxypeptidase
LigandBDBM50364682
Substrate/Competitorn/a
Meas. Tech.ChEMBL_802882 (CHEMBL1953700)
IC50 1.8±n/a nM
Citation Shen, HCDing, FXJiang, JVerras, AChabin, RMXu, STong, XChen, QXie, DLassman, MEBhatt, URGarcia-Calvo, MMGeissler, WShen, ZMurphy, BAGorski, JNWiltsie, JSinhaRoy, RHale, JJPinto, SShen, DM Discovery of benzodihydroisofurans as novel, potent, bioavailable and brain-penetrant prolylcarboxypeptidase inhibitors. Bioorg Med Chem Lett22:1550-6 (2012) 
 
Lysosomal Pro-X carboxypeptidase
Name:Lysosomal Pro-X carboxypeptidase
Type:PROTEIN
Mol. Mass.:55028.96
Organism:Mus musculus
Description:ChEMBL_1335505
Residue:491
BDBM50364682
NameBDBM50364682
Synonyms:CHEMBL1951471 | US8785634, 82
TypeSmall organic molecule
Emp. Form.C24H19Cl2F3N2O4S
Mol. Mass.559.385
SMILESFC(F)(F)Oc1ccc(cc1)S(=O)(=O)N1CCC2(CC1)OC(c1cccnc21)c1cc(Cl)cc(Cl)c1