Reaction Details
TargetLysosomal Pro-X carboxypeptidase
LigandBDBM50364687
Substrate/Competitorn/a
Meas. Tech.ChEMBL_802883 (CHEMBL1953701)
IC50 351±n/a nM
Citation Shen, HCDing, FXJiang, JVerras, AChabin, RMXu, STong, XChen, QXie, DLassman, MEBhatt, URGarcia-Calvo, MMGeissler, WShen, ZMurphy, BAGorski, JNWiltsie, JSinhaRoy, RHale, JJPinto, SShen, DM Discovery of benzodihydroisofurans as novel, potent, bioavailable and brain-penetrant prolylcarboxypeptidase inhibitors. Bioorg Med Chem Lett22:1550-6 (2012) 
 
Lysosomal Pro-X carboxypeptidase
Name:Lysosomal Pro-X carboxypeptidase
Type:PROTEIN
Mol. Mass.:55028.96
Organism:Mus musculus
Description:ChEMBL_1335505
Residue:491
BDBM50364687
NameBDBM50364687
Synonyms:CHEMBL1951476 | US8785634, 8
TypeSmall organic molecule
Emp. Form.C26H25ClF3N3O2
Mol. Mass.503.944
SMILESCC(C)(N1CCC2(CC1)OC(c1cccnc21)c1cc(Cl)ccn1)c1ccc(OC(F)(F)F)cc1