Reaction Details
TargetMetabotropic glutamate receptor 1
LigandBDBM50364723
Substrate/Competitorn/a
Meas. Tech.ChEMBL_803066 (CHEMBL1954372)
IC50 5.7±n/a nM
Citation Bennett, CEBurnett, DAGreenlee, WJKnutson, CEKorakas, PLi, CTulshian, DWu, WLBertorelli, RFredduzzi, SGrilli, MLozza, GReggiani, AVeltri, A Fused tricyclic mGluR1 antagonists for the treatment of neuropathic pain. Bioorg Med Chem Lett22:1575-8 (2012) 
 
Metabotropic glutamate receptor 1
Name:Metabotropic glutamate receptor 1
Type:Enzyme
Mol. Mass.:132358.19
Organism:Homo sapiens (Human)
Description:Q13255
Residue:1194
BDBM50364723
NameBDBM50364723
Synonyms:CHEMBL1951662
TypeSmall organic molecule
Emp. Form.C18H14BrN3OS
Mol. Mass.400.292
SMILESCN(C)c1ccnc2sc3c(ccn(-c4ccc(Br)cc4)c3=O)c12