Reaction Details
TargetMetabotropic glutamate receptor 1
LigandBDBM50364701
Substrate/Competitorn/a
Meas. Tech.ChEMBL_803068 (CHEMBL1954374)
Ki 309±n/a nM
Citation Bennett, CEBurnett, DAGreenlee, WJKnutson, CEKorakas, PLi, CTulshian, DWu, WLBertorelli, RFredduzzi, SGrilli, MLozza, GReggiani, AVeltri, A Fused tricyclic mGluR1 antagonists for the treatment of neuropathic pain. Bioorg Med Chem Lett22:1575-8 (2012) 
 
Metabotropic glutamate receptor 1
Name:Metabotropic glutamate receptor 1
Type:Enzyme Catalytic Domain
Mol. Mass.:133240.47
Organism:RAT
Description:metabotropic glutamate 1/2 0 RAT::P23385
Residue:1199
BDBM50364701
NameBDBM50364701
Synonyms:CHEMBL1951873
TypeSmall organic molecule
Emp. Form.C18H12N4OS
Mol. Mass.332.379
SMILESCNc1ccnc2sc3c(ccn(-c4ccc(cc4)C#N)c3=O)c12