Reaction Details
TargetCyclin-dependent kinase 1
LigandBDBM50364832
Substrate/Competitorn/a
Meas. Tech.ChEMBL_803536 (CHEMBL1953284)
IC50>50000±n/a nM
Citation Hada, KSuda, AAsoh, KTsukuda, THasegawa, MSato, YOgawa, KKuramoto, SAoki, YShimma, NIshikawa, TKoyano, H Angiogenesis inhibitors identified by cell-based high-throughput screening: synthesis, structure-activity relationships and biological evaluation of 3-[(E)-styryl]benzamides that specifically inhibit endothelial cell proliferation. Bioorg Med Chem20:1442-60 (2012) 
 
Cyclin-dependent kinase 1
Name:Cyclin-dependent kinase 1
Type:Enzyme Subunit
Mol. Mass.:34101.08
Organism:Homo sapiens (Human)
Description:P06493
Residue:297
BDBM50364832
NameBDBM50364832
Synonyms:CHEMBL1949788
TypeSmall organic molecule
Emp. Form.C19H20ClNO4
Mol. Mass.361.819
SMILESCOc1ccc(cc1\C=C\c1ccc(Cl)cc1)C(=O)NC[C@@H](O)CO