Reaction Details
TargetTyrosine-protein kinase Fyn
LigandBDBM50364833
Substrate/Competitorn/a
Meas. Tech.ChEMBL_803528 (CHEMBL1953276)
IC50>50000±n/a nM
Citation Hada, KSuda, AAsoh, KTsukuda, THasegawa, MSato, YOgawa, KKuramoto, SAoki, YShimma, NIshikawa, TKoyano, H Angiogenesis inhibitors identified by cell-based high-throughput screening: synthesis, structure-activity relationships and biological evaluation of 3-[(E)-styryl]benzamides that specifically inhibit endothelial cell proliferation. Bioorg Med Chem20:1442-60 (2012) 
 
Tyrosine-protein kinase Fyn
Name:Tyrosine-protein kinase Fyn
Type:Enzyme
Mol. Mass.:60762.21
Organism:Homo sapiens (Human)
Description:P06241
Residue:537
BDBM50364833
NameBDBM50364833
Synonyms:CHEMBL1949789
TypeSmall organic molecule
Emp. Form.C19H20ClNO4
Mol. Mass.361.819
SMILESCOc1ccc(cc1\C=C\c1ccc(Cl)cc1)C(=O)NC[C@H](O)CO