Reaction Details
TargetVascular endothelial growth factor receptor 2
LigandBDBM50364836
Substrate/Competitorn/a
Meas. Tech.ChEMBL_803293 (CHEMBL1955118)
IC50>50000±n/a nM
Citation Hada, KSuda, AAsoh, KTsukuda, THasegawa, MSato, YOgawa, KKuramoto, SAoki, YShimma, NIshikawa, TKoyano, H Angiogenesis inhibitors identified by cell-based high-throughput screening: synthesis, structure-activity relationships and biological evaluation of 3-[(E)-styryl]benzamides that specifically inhibit endothelial cell proliferation. Bioorg Med Chem20:1442-60 (2012) 
 
Vascular endothelial growth factor receptor 2
Name:Vascular endothelial growth factor receptor 2
Type:Receptor Tyrosine Kinase
Mol. Mass.:151510.97
Organism:Homo sapiens (Human)
Description:P35968
Residue:1356
BDBM50364836
NameBDBM50364836
Synonyms:CHEMBL1952358
TypeSmall organic molecule
Emp. Form.C15H14ClNO3
Mol. Mass.291.73
SMILESCOc1ccc(cc1COc1ccc(Cl)cc1)C(N)=O