Reaction Details
TargetCarbonic anhydrase 3
LigandBDBM10880
Substrate/Competitorn/a
Meas. Tech.ChEMBL_803696 (CHEMBL1953736)
IC50 6500±n/a nM
Citation Truppo, ESupuran, CTSandomenico, AVullo, DInnocenti, ADi Fiore, AAlterio, VDe Simone, GMonti, SM Carbonic anhydrase VII is S-glutathionylated without loss of catalytic activity and affinity for sulfonamide inhibitors. Bioorg Med Chem Lett22:1560-4 (2012) 
 
Carbonic anhydrase 3
Name:Carbonic anhydrase 3
Type:Enzyme
Mol. Mass.:29562.11
Organism:Homo sapiens (Human)
Description:Human cloned isozyme.
Residue:260
BDBM10880
NameBDBM10880
Synonyms:AZA AZM acetazolamide Acetazolamide Acetazolamide (AZA) Acetazolamide, 5 Acetazolamide, AZA CHEMBL20 Sulfonamide, 1 US11278534, Example acetazolamide sulfonamide 1
TypeSmall organic molecule
Emp. Form.C4H6N4O3S2
Mol. Mass.222.245
SMILESCC(=O)Nc1nnc(s1)S(N)(=O)=O