Reaction Details
TargetKynurenine--oxoglutarate transaminase 1
LigandBDBM50364915
Substrate/Competitorn/a
Meas. Tech.ChEMBL_804058 (CHEMBL1952453)
IC50 34000±n/a nM
Citation Akladios, FNNadvi, NAPark, JHanrahan, JRKapoor, VGorrell, MDChurch, WB Design and synthesis of novel inhibitors of human kynurenine aminotransferase-I. Bioorg Med Chem Lett22:1579-81 (2012) 
 
Kynurenine--oxoglutarate transaminase 1
Name:Kynurenine--oxoglutarate transaminase 1
Type:Aminotransferase; Lyase
Mol. Mass.:47874.00
Organism:Homo sapiens (Human)
Description:Recombinant hKAT-1 was expressed and purified from Sf9 insect cells.
Residue:422
BDBM50364915
NameBDBM50364915
Synonyms:CHEMBL1950179
TypeSmall organic molecule
Emp. Form.C14H17IN2O4
Mol. Mass.404.2003
SMILESCCOC(=O)C(CCCC(O)=O)=NNc1ccc(I)cc1