Reaction Details
TargetKynurenine--oxoglutarate transaminase 1
LigandBDBM50364918
Substrate/Competitorn/a
Meas. Tech.ChEMBL_804058 (CHEMBL1952453)
IC50>1000000±n/a nM
Citation Akladios, FNNadvi, NAPark, JHanrahan, JRKapoor, VGorrell, MDChurch, WB Design and synthesis of novel inhibitors of human kynurenine aminotransferase-I. Bioorg Med Chem Lett22:1579-81 (2012) 
 
Kynurenine--oxoglutarate transaminase 1
Name:Kynurenine--oxoglutarate transaminase 1
Type:Aminotransferase; Lyase
Mol. Mass.:47874.00
Organism:Homo sapiens (Human)
Description:Recombinant hKAT-1 was expressed and purified from Sf9 insect cells.
Residue:422
BDBM50364918
NameBDBM50364918
Synonyms:CHEMBL1950317
TypeSmall organic molecule
Emp. Form.C13H13NO4
Mol. Mass.247.2466
SMILESCc1ccc2[nH]c(C(O)=O)c(CCC(O)=O)c2c1