Reaction Details
TargetCannabinoid receptor 1
LigandBDBM50364923
Substrate/Competitorn/a
Meas. Tech.ChEMBL_804070 (CHEMBL1952635)
EC50 33±n/a nM
Citation Cheng, YXPourashraf, MLuo, XSrivastava, SWalpole, CSalois, DSt-Onge, SPayza, KLessard, EYu, XHTomaszewski, MJ ¿-Carbolines: a novel class of cannabinoid agonists with high aqueous solubility and restricted CNS penetration. Bioorg Med Chem Lett22:1619-24 (2012) 
 
Cannabinoid receptor 1
Name:Cannabinoid receptor 1
Type:G Protein-Coupled Receptor (GPCR)
Mol. Mass.:52868.96
Organism:Homo sapiens (Human)
Description:P21554
Residue:472
BDBM50364923
NameBDBM50364923
Synonyms:CHEMBL1950333
TypeSmall organic molecule
Emp. Form.C26H35N3O
Mol. Mass.405.5756
SMILESCC1CCN(CC1)C(=O)c1ccc2n(CC=C)c3CCN(Cc3c2c1)C1CCCC1