Reaction Details
TargetMu-type opioid receptor
LigandBDBM50364920
Substrate/Competitorn/a
Meas. Tech.ChEMBL_804128 (CHEMBL1952693)
IC50>10000±n/a nM
Citation Cheng, YXPourashraf, MLuo, XSrivastava, SWalpole, CSalois, DSt-Onge, SPayza, KLessard, EYu, XHTomaszewski, MJ ¿-Carbolines: a novel class of cannabinoid agonists with high aqueous solubility and restricted CNS penetration. Bioorg Med Chem Lett22:1619-24 (2012) 
 
Mu-type opioid receptor
Name:Mu-type opioid receptor
Type:G Protein-Coupled Receptor (GPCR)
Mol. Mass.:44789.51
Organism:Homo sapiens (Human)
Description:P35372
Residue:400
BDBM50364920
NameBDBM50364920
Synonyms:CHEMBL1950351
TypeSmall organic molecule
Emp. Form.C25H35N3O4S
Mol. Mass.473.628
SMILESCCS(=O)(=O)n1c2CCN(Cc2c2cc(ccc12)C(=O)N1CCC(C)CC1)C1CCOCC1