Reaction Details
TargetCannabinoid receptor 1
LigandBDBM50364920
Substrate/Competitorn/a
Meas. Tech.ChEMBL_804073 (CHEMBL1952638)
EC50 85±n/a nM
Citation Cheng, YXPourashraf, MLuo, XSrivastava, SWalpole, CSalois, DSt-Onge, SPayza, KLessard, EYu, XHTomaszewski, MJ ¿-Carbolines: a novel class of cannabinoid agonists with high aqueous solubility and restricted CNS penetration. Bioorg Med Chem Lett22:1619-24 (2012) 
 
Cannabinoid receptor 1
Name:Cannabinoid receptor 1
Type:G Protein-Coupled Receptor (GPCR)
Mol. Mass.:52856.55
Organism:Rattus norvegicus (rat)
Description:P20272
Residue:473
BDBM50364920
NameBDBM50364920
Synonyms:CHEMBL1950351
TypeSmall organic molecule
Emp. Form.C25H35N3O4S
Mol. Mass.473.628
SMILESCCS(=O)(=O)n1c2CCN(Cc2c2cc(ccc12)C(=O)N1CCC(C)CC1)C1CCOCC1