Reaction Details
TargetCannabinoid receptor 1
LigandBDBM50364941
Substrate/Competitorn/a
Meas. Tech.ChEMBL_804069 (CHEMBL1952464)
Ki 51±n/a nM
Citation Cheng, YXPourashraf, MLuo, XSrivastava, SWalpole, CSalois, DSt-Onge, SPayza, KLessard, EYu, XHTomaszewski, MJ ¿-Carbolines: a novel class of cannabinoid agonists with high aqueous solubility and restricted CNS penetration. Bioorg Med Chem Lett22:1619-24 (2012) 
 
Cannabinoid receptor 1
Name:Cannabinoid receptor 1
Type:G Protein-Coupled Receptor (GPCR)
Mol. Mass.:52868.96
Organism:Homo sapiens (Human)
Description:P21554
Residue:472
BDBM50364941
NameBDBM50364941
Synonyms:CHEMBL1950357
TypeSmall organic molecule
Emp. Form.C32H41N3O3
Mol. Mass.515.6862
SMILESCCOc1ccc(Cn2c3CCN(Cc3c3cc(ccc23)C(=O)N2CCC(C)CC2)C2CCOCC2)cc1