Reaction Details
TargetCannabinoid receptor 1
LigandBDBM50364945
Substrate/Competitorn/a
Meas. Tech.ChEMBL_804069 (CHEMBL1952464)
Ki 197±n/a nM
Citation Cheng, YXPourashraf, MLuo, XSrivastava, SWalpole, CSalois, DSt-Onge, SPayza, KLessard, EYu, XHTomaszewski, MJ ¿-Carbolines: a novel class of cannabinoid agonists with high aqueous solubility and restricted CNS penetration. Bioorg Med Chem Lett22:1619-24 (2012) 
 
Cannabinoid receptor 1
Name:Cannabinoid receptor 1
Type:G Protein-Coupled Receptor (GPCR)
Mol. Mass.:52868.96
Organism:Homo sapiens (Human)
Description:P21554
Residue:472
BDBM50364945
NameBDBM50364945
Synonyms:CHEMBL1950488
TypeSmall organic molecule
Emp. Form.C24H33N3O4S
Mol. Mass.459.602
SMILESCCS(=O)(=O)n1c2CCN(Cc2c2cc(ccc12)C(=O)N1CCC(C)CC1)C1CCOC1