Reaction Details
TargetCannabinoid receptor 1
LigandBDBM50364953
Substrate/Competitorn/a
Meas. Tech.ChEMBL_804070 (CHEMBL1952635)
EC50 5423±n/a nM
Citation Cheng, YXPourashraf, MLuo, XSrivastava, SWalpole, CSalois, DSt-Onge, SPayza, KLessard, EYu, XHTomaszewski, MJ ¿-Carbolines: a novel class of cannabinoid agonists with high aqueous solubility and restricted CNS penetration. Bioorg Med Chem Lett22:1619-24 (2012) 
 
Cannabinoid receptor 1
Name:Cannabinoid receptor 1
Type:G Protein-Coupled Receptor (GPCR)
Mol. Mass.:52868.96
Organism:Homo sapiens (Human)
Description:P21554
Residue:472
BDBM50364953
NameBDBM50364953
Synonyms:CHEMBL1950338
TypeSmall organic molecule
Emp. Form.C27H32N4O
Mol. Mass.428.5692
SMILESCC1CCN(CC1)C(=O)c1ccc2n(CC=C)c3CCN(Cc4ccccn4)Cc3c2c1