Reaction Details
TargetCannabinoid receptor 1
LigandBDBM50364930
Substrate/Competitorn/a
Meas. Tech.ChEMBL_804076 (CHEMBL1952641)
EC50 117±n/a nM
Citation Cheng, YXPourashraf, MLuo, XSrivastava, SWalpole, CSalois, DSt-Onge, SPayza, KLessard, EYu, XHTomaszewski, MJ ¿-Carbolines: a novel class of cannabinoid agonists with high aqueous solubility and restricted CNS penetration. Bioorg Med Chem Lett22:1619-24 (2012) 
 
Cannabinoid receptor 1
Name:Cannabinoid receptor 1
Type:G Protein-Coupled Receptor (GPCR)
Mol. Mass.:52868.96
Organism:Homo sapiens (Human)
Description:P21554
Residue:472
BDBM50364930
NameBDBM50364930
Synonyms:CHEMBL1950345
TypeSmall organic molecule
Emp. Form.C27H37N3O3
Mol. Mass.451.601
SMILESCCCC(=O)n1c2CCN(Cc2c2cc(ccc12)C(=O)N1CCC(C)CC1)C1CCOCC1