Reaction Details
TargetHistamine H3 receptor
LigandBDBM50364957
Substrate/Competitorn/a
Meas. Tech.ChEMBL_804458 (CHEMBL1952468)
Ki 2.2±n/a nM
Citation Hudkins, RLZulli, ALDandu, RrTao, MJosef, KAAimone, LDHaltiwanger, RCHuang, ZLyons, JAMathiasen, JRRaddatz, RGruner, JA 4-phenoxypiperidine pyridazin-3-one histamine H(3) receptor inverse agonists demonstrating potent and robust wake promoting activity. Bioorg Med Chem Lett22:1504-9 (2012) 
 
Histamine H3 receptor
Name:Histamine H3 receptor
Type:G Protein-Coupled Receptor (GPCR)
Mol. Mass.:48607.98
Organism:Rattus norvegicus (rat)
Description:n/a
Residue:445
BDBM50364957
NameBDBM50364957
Synonyms:CHEMBL1950643
TypeSmall organic molecule
Emp. Form.C19H23N3O2
Mol. Mass.325.4048
SMILESO=c1ccc(n[nH]1)-c1ccc(OC2CCN(CC2)C2CCC2)cc1