Reaction Details
TargetHistamine H3 receptor
LigandBDBM50365052
Substrate/Competitorn/a
Meas. Tech.ChEMBL_804715 (CHEMBL1953342)
Ki 9±n/a nM
Citation Sundar, BGBailey, TRDunn, DHostetler, GAChatterjee, SBacon, ERYue, CSchweizer, DAimone, LDGruner, JALyons, JRaddatz, RLesur, B Novel morpholine ketone analogs as potent histamine H3 receptor inverse agonists with wake activity. Bioorg Med Chem Lett22:1546-9 (2012) 
 
Histamine H3 receptor
Name:Histamine H3 receptor
Type:G Protein-Coupled Receptor (GPCR)
Mol. Mass.:48691.47
Organism:Homo sapiens (Human)
Description:Binding assays were using CHO cells stably expressing hH3R receptors.
Residue:445
BDBM50365052
NameBDBM50365052
Synonyms:CHEMBL1951061
TypeSmall organic molecule
Emp. Form.C22H34N2O3
Mol. Mass.374.517
SMILESC[C@@H]1CCCN1CCCOc1ccc(cc1)C(=O)C(C)(C)N1CCOCC1