Reaction Details
TargetcAMP-specific 3',5'-cyclic phosphodiesterase 4B
LigandBDBM50346088
Substrate/Competitorn/a
Meas. Tech.ChEMBL_804873 (CHEMBL1953791)
IC50 120±n/a nM
Citation Shan, WJHuang, LZhou, QJiang, HLLuo, ZHLai, KFLi, XS Dualß2-adrenoceptor agonists-PDE4 inhibitors for the treatment of asthma and COPD. Bioorg Med Chem Lett22:1523-6 (2012) 
 
cAMP-specific 3',5'-cyclic phosphodiesterase 4B
Name:cAMP-specific 3',5'-cyclic phosphodiesterase 4B
Type:Protein
Mol. Mass.:83318.87
Organism:Homo sapiens (Human)
Description:Q07343
Residue:736
BDBM50346088
NameBDBM50346088
Synonyms:(1r,4r)-4-cyano-4-(3-(cyclopentyloxy)-4-methoxyphenyl)cyclohexanecarboxylic acid 4-Cyano-4-(3-cyclopentyloxy-4-methoxy-phenyl)-cyclohexanecarboxylic acid 4-Cyano-4-(3-cyclopentyloxy-4-methoxy-phenyl)-cyclohexanecarboxylic acid methyl ester 6-(3,4-Dimethoxy-phenyl)-5-methyl-4,5-dihydro-2H-pyridazin-3-one CHEMBL511115 | SB-207499
TypeSmall organic molecule
Emp. Form.C20H25NO4
Mol. Mass.343.4168
SMILESCOc1ccc(cc1OC1CCCC1)[C@]1(CC[C@@H](CC1)C(O)=O)C#N