Reaction Details
TargetcAMP-specific 3',5'-cyclic phosphodiesterase 4B
LigandBDBM50106185
Substrate/Competitorn/a
Meas. Tech.ChEMBL_804873 (CHEMBL1953791)
IC50 520±n/a nM
Citation Shan, WJHuang, LZhou, QJiang, HLLuo, ZHLai, KFLi, XS Dualß2-adrenoceptor agonists-PDE4 inhibitors for the treatment of asthma and COPD. Bioorg Med Chem Lett22:1523-6 (2012) 
 
cAMP-specific 3',5'-cyclic phosphodiesterase 4B
Name:cAMP-specific 3',5'-cyclic phosphodiesterase 4B
Type:Protein
Mol. Mass.:83318.87
Organism:Homo sapiens (Human)
Description:Q07343
Residue:736
BDBM50106185
NameBDBM50106185
Synonyms:2H-Phthalazin-1-one | CHEMBL124706
TypeSmall organic molecule
Emp. Form.C8H6N2O
Mol. Mass.146.146
SMILESO=c1[nH]ncc2ccccc12