Reaction Details
TargetBeta-2 adrenergic receptor
LigandBDBM50365057
Substrate/Competitorn/a
Meas. Tech.ChEMBL_804869 (CHEMBL1953787)
EC50 0.501±n/a nM
Citation Shan, WJHuang, LZhou, QJiang, HLLuo, ZHLai, KFLi, XS Dualß2-adrenoceptor agonists-PDE4 inhibitors for the treatment of asthma and COPD. Bioorg Med Chem Lett22:1523-6 (2012) 
 
Beta-2 adrenergic receptor
Name:Beta-2 adrenergic receptor
Type:Enzyme Catalytic Domain
Mol. Mass.:46993.24
Organism:GUINEA PIG
Description:adrenergic Beta2 ADRB2 GUINEA PIG::Q8K4Z4
Residue:418
BDBM50365057
NameBDBM50365057
Synonyms:CHEMBL1951066
TypeSmall organic molecule
Emp. Form.C29H38N4O6
Mol. Mass.538.6352
SMILESCOc1ccc(cc1OC)C1=NN(CCCCNCC(O)c2ccc(O)c(NC=O)c2)C(=O)C2CCCCC12