Reaction Details
TargetDelta-type opioid receptor
LigandBDBM50381677
Substrate/Competitorn/a
Meas. Tech.ChEMBL_805243 (CHEMBL1955136)
Ki 12540±n/a nM
Citation Iyer, MRLee, YSDeschamps, JRDersch, CMRothman, RBJacobson, AERice, KC Probes for narcotic receptor mediated phenomena. 44. Synthesis of an N-substituted 4-hydroxy-5-(3-hydroxyphenyl)morphan with high affinity and selectiveµ-antagonist activity. Eur J Med Chem50:44-54 (2012) 
 
Delta-type opioid receptor
Name:Delta-type opioid receptor
Type:G Protein-Coupled Receptor (GPCR)
Mol. Mass.:40382.98
Organism:Homo sapiens (Human)
Description:Competition binding assays were carried out using membrane preparations from transfected HN9.10 cells that constitutively expressed the delta opioid receptor.
Residue:372
BDBM50381677
NameBDBM50381677
Synonyms:CHEMBL1256748 | U-69593
TypeSmall organic molecule
Emp. Form.C22H32N2O2
Mol. Mass.356.5017
SMILESCN([C@H]1C[C@@]2(CCCO2)CC[C@@H]1N1CCCC1)C(=O)Cc1ccccc1