Reaction Details
TargetKappa-type opioid receptor
LigandBDBM50365110
Substrate/Competitorn/a
Meas. Tech.ChEMBL_805244 (CHEMBL1955137)
Ki 8300±n/a nM
Citation Iyer, MRLee, YSDeschamps, JRDersch, CMRothman, RBJacobson, AERice, KC Probes for narcotic receptor mediated phenomena. 44. Synthesis of an N-substituted 4-hydroxy-5-(3-hydroxyphenyl)morphan with high affinity and selectiveµ-antagonist activity. Eur J Med Chem50:44-54 (2012) 
 
Kappa-type opioid receptor
Name:Kappa-type opioid receptor
Type:G Protein-Coupled Receptor (GPCR)
Mol. Mass.:42648.76
Organism:Homo sapiens (Human)
Description:P41145
Residue:380
BDBM50365110
NameBDBM50365110
Synonyms:CHEMBL1951700
TypeSmall organic molecule
Emp. Form.C15H21NO2
Mol. Mass.247.3327
SMILESCN1C[C@@H](O)[C@@]2(CCC[C@H]1C2)c1cccc(O)c1