Reaction Details
TargetProthrombin
LigandBDBM50365131
Substrate/Competitorn/a
Meas. Tech.ChEMBL_802701 (CHEMBL1953227)
Ki 18±n/a nM
Citation Ilic, MKikelj, DIlaš, J Fluorinated dual antithrombotic compounds based on 1,4-benzoxazine scaffold. Eur J Med Chem50:255-63 (2012) 
 
Prothrombin
Name:Prothrombin
Type:Protein
Mol. Mass.:70029.57
Organism:Homo sapiens (Human)
Description:P00734
Residue:622
BDBM50365131
NameBDBM50365131
Synonyms:CHEMBL1949838
TypeSmall organic molecule
Emp. Form.C29H30F2N4O5
Mol. Mass.552.5691
SMILESCCOC(=O)C(=O)N(Cc1cc(F)cc(F)c1)c1ccc2N(C)CC(C)(COc3ccc(cc3)C(N)=N)Oc2c1