Reaction Details
TargetProstaglandin G/H synthase 2
LigandBDBM50365162
Substrate/Competitorn/a
Meas. Tech.ChEMBL_805485 (CHEMBL1955378)
IC50 40±n/a nM
Citation Hayashi, SUeno, NMurase, ANakagawa, YTakada, J Novel acid-type cyclooxygenase-2 inhibitors: Design, synthesis, and structure-activity relationship for anti-inflammatory drug. Eur J Med Chem50:179-95 (2012) 
 
Prostaglandin G/H synthase 2
Name:Prostaglandin G/H synthase 2
Type:Enzyme
Mol. Mass.:69003.89
Organism:Homo sapiens (Human)
Description:Recombinant Cox-2 provided by Cayman (Cayman Chemical Co.,Ann Arbor, MI).
Residue:604
BDBM50365162
NameBDBM50365162
Synonyms:CHEMBL1950014
TypeSmall organic molecule
Emp. Form.C18H13F3N2O4
Mol. Mass.378.302
SMILESCc1ccnc(c1)C(=O)c1[nH]c2ccc(OC(F)(F)F)cc2c1CC(O)=O