Reaction Details
TargetProstaglandin G/H synthase 2
LigandBDBM50365158
Substrate/Competitorn/a
Meas. Tech.ChEMBL_805485 (CHEMBL1955378)
IC50 128±n/a nM
Citation Hayashi, SUeno, NMurase, ANakagawa, YTakada, J Novel acid-type cyclooxygenase-2 inhibitors: Design, synthesis, and structure-activity relationship for anti-inflammatory drug. Eur J Med Chem50:179-95 (2012) 
 
Prostaglandin G/H synthase 2
Name:Prostaglandin G/H synthase 2
Type:Enzyme
Mol. Mass.:69003.89
Organism:Homo sapiens (Human)
Description:Recombinant Cox-2 provided by Cayman (Cayman Chemical Co.,Ann Arbor, MI).
Residue:604
BDBM50365158
NameBDBM50365158
Synonyms:CHEMBL1950010
TypeSmall organic molecule
Emp. Form.C18H16N2O4
Mol. Mass.324.3306
SMILESCOc1ccc2c(CC(O)=O)c([nH]c2c1)C(=O)c1cc(C)ccn1