Reaction Details
TargetProstaglandin G/H synthase 2
LigandBDBM50365161
Substrate/Competitorn/a
Meas. Tech.ChEMBL_805488 (CHEMBL1955381)
IC50 1600±n/a nM
Citation Hayashi, SUeno, NMurase, ANakagawa, YTakada, J Novel acid-type cyclooxygenase-2 inhibitors: Design, synthesis, and structure-activity relationship for anti-inflammatory drug. Eur J Med Chem50:179-95 (2012) 
 
Prostaglandin G/H synthase 2
Name:Prostaglandin G/H synthase 2
Type:Enzyme
Mol. Mass.:69003.89
Organism:Homo sapiens (Human)
Description:Recombinant Cox-2 provided by Cayman (Cayman Chemical Co.,Ann Arbor, MI).
Residue:604
BDBM50365161
NameBDBM50365161
Synonyms:CHEMBL1950013
TypeSmall organic molecule
Emp. Form.C19H18N2O3
Mol. Mass.322.3578
SMILESCCc1ccc2[nH]c(C(=O)c3cc(C)ccn3)c(CC(O)=O)c2c1