Reaction Details
TargetInhibitor of nuclear factor kappa-B kinase subunit beta
LigandBDBM14047
Substrate/Competitorn/a
Meas. Tech.ChEMBL_807425 (CHEMBL1960796)
IC50>10000±n/a nM
Citation Doe, CBentley, RBehm, DJLafferty, RStavenger, RJung, DBamford, MPanchal, TGrygielko, EWright, LLSmith, GKChen, ZWebb, CKhandekar, SYi, TKirkpatrick, RDul, EJolivette, LMarino, JPWillette, RLee, DHu, E Novel Rho kinase inhibitors with anti-inflammatory and vasodilatory activities. J Pharmacol Exp Ther320:89-98 (2006) 
 
Inhibitor of nuclear factor kappa-B kinase subunit beta
Name:Inhibitor of nuclear factor kappa-B kinase subunit beta
Type:Serine/threonine-protein kinase
Mol. Mass.:86554.39
Organism:Homo sapiens (Human)
Description:GST-tagged IKK-2 was expressed in High Five cells and purified.
Residue:756
BDBM14047
NameBDBM14047
Synonyms:Aminofurazanyl-azabenzimidazole 6n | N-(3-{[2-(4-amino-1,2,5-oxadiazol-3-yl)-1-ethyl-1H-imidazo[4,5-c]pyridin-6-yl]oxy}phenyl)-4-[2-(morpholin-4-yl)ethoxy]benzamide
TypeSmall organic molecule
Emp. Form.C29H30N8O5
Mol. Mass.570.5991
SMILESCCn1c(nc2cnc(Oc3cccc(NC(=O)c4ccc(OCCN5CCOCC5)cc4)c3)cc12)-c1nonc1N