Reaction Details
Target5-hydroxytryptamine receptor 3A
LigandBDBM50365247
Substrate/Competitorn/a
Meas. Tech.ChEMBL_805903 (CHEMBL1960084)
Ki 13±n/a nM
Citation Tao, MAimone, LDHuang, ZMathiasen, JRaddatz, RLyons, JHudkins, RL Optimization of 5-pyridazin-3-one phenoxypropylamines as potent, selective histamine H3 receptor antagonists with potent cognition enhancing activity. J Med Chem55:414-23 (2012) 
 
5-hydroxytryptamine receptor 3A
Name:5-hydroxytryptamine receptor 3A
Type:Protein
Mol. Mass.:55283.27
Organism:Homo sapiens (Human)
Description:P46098
Residue:478
BDBM50365247
NameBDBM50365247
Synonyms:CHEMBL1958134
TypeSmall organic molecule
Emp. Form.C19H25N3O2
Mol. Mass.327.4207
SMILESCn1ncc(cc1=O)-c1ccc(OCCCN2CCCCC2)cc1