Reaction Details
Target5-hydroxytryptamine receptor 3A
LigandBDBM50365260
Substrate/Competitorn/a
Meas. Tech.ChEMBL_805903 (CHEMBL1960084)
Ki 1.7±n/a nM
Citation Tao, MAimone, LDHuang, ZMathiasen, JRaddatz, RLyons, JHudkins, RL Optimization of 5-pyridazin-3-one phenoxypropylamines as potent, selective histamine H3 receptor antagonists with potent cognition enhancing activity. J Med Chem55:414-23 (2012) 
 
5-hydroxytryptamine receptor 3A
Name:5-hydroxytryptamine receptor 3A
Type:Protein
Mol. Mass.:55283.27
Organism:Homo sapiens (Human)
Description:P46098
Residue:478
BDBM50365260
NameBDBM50365260
Synonyms:CHEMBL1958333
TypeSmall organic molecule
Emp. Form.C24H28N4O2
Mol. Mass.404.5047
SMILESC[C@@H]1CCCN1CCCOc1ccc(cc1)-c1cc(=O)n(nc1C)-c1ccccn1