Reaction Details
Target5-hydroxytryptamine receptor 3A
LigandBDBM50365245
Substrate/Competitorn/a
Meas. Tech.ChEMBL_805902 (CHEMBL1960083)
Ki 28±n/a nM
Citation Tao, MAimone, LDHuang, ZMathiasen, JRaddatz, RLyons, JHudkins, RL Optimization of 5-pyridazin-3-one phenoxypropylamines as potent, selective histamine H3 receptor antagonists with potent cognition enhancing activity. J Med Chem55:414-23 (2012) 
 
5-hydroxytryptamine receptor 3A
Name:5-hydroxytryptamine receptor 3A
Type:Enzyme Catalytic Domain
Mol. Mass.:55428.70
Organism:RAT
Description:5-HT3 HTR3A RAT::P35563
Residue:483
BDBM50365245
NameBDBM50365245
Synonyms:CHEMBL1958132
TypeSmall organic molecule
Emp. Form.C18H23N3O2
Mol. Mass.313.3941
SMILESO=c1cc(cn[nH]1)-c1ccc(OCCCN2CCCCC2)cc1