Reaction Details
Target5-hydroxytryptamine receptor 3A
LigandBDBM50365261
Substrate/Competitorn/a
Meas. Tech.ChEMBL_805902 (CHEMBL1960083)
Ki 17±n/a nM
Citation Tao, MAimone, LDHuang, ZMathiasen, JRaddatz, RLyons, JHudkins, RL Optimization of 5-pyridazin-3-one phenoxypropylamines as potent, selective histamine H3 receptor antagonists with potent cognition enhancing activity. J Med Chem55:414-23 (2012) 
 
5-hydroxytryptamine receptor 3A
Name:5-hydroxytryptamine receptor 3A
Type:Enzyme Catalytic Domain
Mol. Mass.:55428.70
Organism:RAT
Description:5-HT3 HTR3A RAT::P35563
Residue:483
BDBM50365261
NameBDBM50365261
Synonyms:CHEMBL1958334
TypeSmall organic molecule
Emp. Form.C25H30N4O2
Mol. Mass.418.5313
SMILESC[C@@H]1CCCN1CCCOc1ccc(cc1)-c1cc(=O)n(nc1C)-c1ncccc1C