Reaction Details
TargetCytochrome P450 2C9
LigandBDBM50363325
Substrate/Competitorn/a
Meas. Tech.ChEMBL_805912 (CHEMBL1960240)
IC50>30000±n/a nM
Citation Tao, MAimone, LDHuang, ZMathiasen, JRaddatz, RLyons, JHudkins, RL Optimization of 5-pyridazin-3-one phenoxypropylamines as potent, selective histamine H3 receptor antagonists with potent cognition enhancing activity. J Med Chem55:414-23 (2012) 
 
Cytochrome P450 2C9
Name:Cytochrome P450 2C9
Type:Enzyme
Mol. Mass.:55636.33
Organism:Homo sapiens (Human)
Description:P11712
Residue:490
BDBM50363325
NameBDBM50363325
Synonyms:CHEMBL1945843
TypeSmall organic molecule
Emp. Form.C23H26N4O2
Mol. Mass.390.4781
SMILESC[C@@H]1CCCN1CCCOc1ccc(cc1)-c1cnn(-c2ccccn2)c(=O)c1