Reaction Details
TargetProstaglandin G/H synthase 2
LigandBDBM22360
Substrate/Competitorn/a
Meas. Tech.ChEMBL_806310 (CHEMBL1959074)
IC50 2400±n/a nM
Citation Jain, STran, SEl Gendy, MAKashfi, KJurasz, PVelázquez-Martínez, CA Nitric oxide release is not required to decrease the ulcerogenic profile of nonsteroidal anti-inflammatory drugs. J Med Chem55:688-96 (2012) 
 
Prostaglandin G/H synthase 2
Name:Prostaglandin G/H synthase 2
Type:Enzyme
Mol. Mass.:69003.89
Organism:Homo sapiens (Human)
Description:Recombinant Cox-2 provided by Cayman (Cayman Chemical Co.,Ann Arbor, MI).
Residue:604
BDBM22360
NameBDBM22360
Synonyms:2-(acetyloxy)benzoate Acetylsalicylic acid Endosprin Zorprin cid_2244
TypeAnti-Inflammatory Agents, Non-Steroidal
Emp. Form.C9H8O4
Mol. Mass.180.1574
SMILESCC(=O)Oc1ccccc1C(O)=O