Reaction Details
TargetAcetyl-CoA carboxylase 2
LigandBDBM50365279
Substrate/Competitorn/a
Meas. Tech.ChEMBL_806323 (CHEMBL1959087)
IC50 6.9±n/a nM
Citation Freeman-Cook, KDAmor, PBader, SBuzon, LMCoffey, SBCorbett, JWDirico, KJDoran, SDElliott, RLEsler, WGuzman-Perez, AHenegar, KEHouser, JAJones, CSLimberakis, CLoomis, KMcPherson, KMurdande, SNelson, KLPhillion, DPierce, BSSong, WSugarman, ETapley, STu, MZhao, Z Maximizing lipophilic efficiency: the use of Free-Wilson analysis in the design of inhibitors of acetyl-CoA carboxylase. J Med Chem55:935-42 (2012) 
 
Acetyl-CoA carboxylase 2
Name:Acetyl-CoA carboxylase 2
Type:Protein
Mol. Mass.:276535.21
Organism:Homo sapiens (Human)
Description:O00763
Residue:2458
BDBM50365279
NameBDBM50365279
Synonyms:CHEMBL1958360
TypeSmall organic molecule
Emp. Form.C23H27N5O3
Mol. Mass.421.4922
SMILESCc1cc(cc2cn[nH]c12)C(=O)N1CCC2(CC1)CC(=O)c1nn(cc1O2)C(C)(C)C