Reaction Details
TargetAdenosine receptor A2b
LigandBDBM50365317
Substrate/Competitorn/a
Meas. Tech.ChEMBL_806471 (CHEMBL1959510)
IC50 9±n/a nM
Citation Baraldi, PGBaraldi, SSaponaro, GPreti, DRomagnoli, RPiccagli, LCavalli, ARecanatini, MMoorman, ARZaid, ANVarani, KBorea, PATabrizi, MA Novel 1,3-dipropyl-8-(3-benzimidazol-2-yl-methoxy-1-methylpyrazol-5-yl)xanthines as potent and selective A2B adenosine receptor antagonists. J Med Chem55:797-811 (2012) 
 
Adenosine receptor A2b
Name:Adenosine receptor A2b
Type:G Protein-Coupled Receptor (GPCR)
Mol. Mass.:36341.22
Organism:Homo sapiens (Human)
Description:n/a
Residue:332
BDBM50365317
NameBDBM50365317
Synonyms:CHEMBL1955923
TypeSmall organic molecule
Emp. Form.C16H21N5O3
Mol. Mass.331.3696
SMILESCCCn1c2cc([nH]c2c(=O)n(CCC)c1=O)-c1cc(=O)[nH]n1C