Reaction Details
TargetAdenosine receptor A2b
LigandBDBM50365323
Substrate/Competitorn/a
Meas. Tech.ChEMBL_806468 (CHEMBL1959507)
Ki 14.2±n/a nM
Citation Baraldi, PGBaraldi, SSaponaro, GPreti, DRomagnoli, RPiccagli, LCavalli, ARecanatini, MMoorman, ARZaid, ANVarani, KBorea, PATabrizi, MA Novel 1,3-dipropyl-8-(3-benzimidazol-2-yl-methoxy-1-methylpyrazol-5-yl)xanthines as potent and selective A2B adenosine receptor antagonists. J Med Chem55:797-811 (2012) 
 
Adenosine receptor A2b
Name:Adenosine receptor A2b
Type:G Protein-Coupled Receptor (GPCR)
Mol. Mass.:36341.22
Organism:Homo sapiens (Human)
Description:n/a
Residue:332
BDBM50365323
NameBDBM50365323
Synonyms:CHEMBL1955900
TypeSmall organic molecule
Emp. Form.C24H28N8O4
Mol. Mass.492.5303
SMILESCCCn1c2nc([nH]c2c(=O)n(CCC)c1=O)-c1cc(OCc2nc3ccc(OC)cc3[nH]2)nn1C