Reaction Details
TargetAdenosine receptor A2b
LigandBDBM50365318
Substrate/Competitorn/a
Meas. Tech.ChEMBL_806468 (CHEMBL1959507)
Ki 11.4±n/a nM
Citation Baraldi, PGBaraldi, SSaponaro, GPreti, DRomagnoli, RPiccagli, LCavalli, ARecanatini, MMoorman, ARZaid, ANVarani, KBorea, PATabrizi, MA Novel 1,3-dipropyl-8-(3-benzimidazol-2-yl-methoxy-1-methylpyrazol-5-yl)xanthines as potent and selective A2B adenosine receptor antagonists. J Med Chem55:797-811 (2012) 
 
Adenosine receptor A2b
Name:Adenosine receptor A2b
Type:G Protein-Coupled Receptor (GPCR)
Mol. Mass.:36341.22
Organism:Homo sapiens (Human)
Description:n/a
Residue:332
BDBM50365318
NameBDBM50365318
Synonyms:CHEMBL1955924
TypeSmall organic molecule
Emp. Form.C24H27N7O3
Mol. Mass.461.5163
SMILESCCCn1c2cc([nH]c2c(=O)n(CCC)c1=O)-c1cc(OCc2nc3ccccc3[nH]2)nn1C