Reaction Details
TargetNitric oxide synthase, brain
LigandBDBM50365335
Substrate/Competitorn/a
Meas. Tech.ChEMBL_806489 (CHEMBL1959528)
IC50 70±n/a nM
Citation Annedi, SCRamnauth, JMaddaford, SPRenton, PRakhit, SMladenova, GDove, PSilverman, SAndrews, JSFelice, MDPorreca, F Discovery of cis-N-(1-(4-(methylamino)cyclohexyl)indolin-6-yl)thiophene-2-carboximidamide: a 1,6-disubstituted indoline derivative as a highly selective inhibitor of human neuronal nitric oxide synthase (nNOS) without any cardiovascular liabilities. J Med Chem55:943-55 (2012) 
 
Nitric oxide synthase, brain
Name:Nitric oxide synthase, brain
Type:Homodimer
Mol. Mass.:160985.98
Organism:Homo sapiens (Human)
Description:P29475
Residue:1434
BDBM50365335
NameBDBM50365335
Synonyms:CHEMBL1955937
TypeSmall organic molecule
Emp. Form.C17H22N4OS
Mol. Mass.330.448
SMILESNC(=Nc1ccc2CCN(CCNCCO)c2c1)c1cccs1