Reaction Details
TargetMatrix metalloproteinase-9
LigandBDBM50365344
Substrate/Competitorn/a
Meas. Tech.ChEMBL_806643 (CHEMBL1960126)
Ki>10000±n/a nM
Citation Brown, MFReilly, UAbramite, JAArcari, JTOliver, RBarham, RAChe, YChen, JMCollantes, EMChung, SWDesbonnet, CDoty, JDoroski, MEngtrakul, JJHarris, TMHuband, MKnafels, JDLeach, KLLiu, SMarfat, AMarra, AMcElroy, EMelnick, MMenard, CAMontgomery, JIMullins, LNoe, MCO'Donnell, JPenzien, JPlummer, MSPrice, LMShanmugasundaram, VThoma, CUccello, DPWarmus, JSWishka, DG Potent inhibitors of LpxC for the treatment of Gram-negative infections. J Med Chem55:914-23 (2012) 
 
Matrix metalloproteinase-9
Name:Matrix metalloproteinase-9
Type:Enzyme
Mol. Mass.:78452.28
Organism:Homo sapiens (Human)
Description:P14780
Residue:707
BDBM50365344
NameBDBM50365344
Synonyms:CHEMBL1956115
TypeSmall organic molecule
Emp. Form.C18H21NO4S
Mol. Mass.347.429
SMILESC[C@@](CCc1ccc(cc1)-c1ccccc1)(C(=O)NO)S(C)(=O)=O