Reaction Details
TargetMast/stem cell growth factor receptor Kit
LigandBDBM50355467
Substrate/Competitorn/a
Meas. Tech.ChEMBL_806855 (CHEMBL1958983)
IC50 2300±n/a nM
Citation Heidary, DKHuang, GBoucher, DMa, JForster, CGrey, RXu, JArnost, MChoquette, DChen, GZhou, JHYao, YMBall, EDNamchuk, MDavies, RJHenkel, G VX-322: a novel dual receptor tyrosine kinase inhibitor for the treatment of acute myelogenous leukemia. J Med Chem55:725-34 (2012) 
 
Mast/stem cell growth factor receptor Kit
Name:Mast/stem cell growth factor receptor Kit
Type:Protein
Mol. Mass.:109869.37
Organism:Homo sapiens (Human)
Description:P10721
Residue:976
BDBM50355467
NameBDBM50355467
Synonyms:CHEMBL1833992
TypeSmall organic molecule
Emp. Form.C18H21N7O2
Mol. Mass.367.405
SMILESCOc1ccc(cc1Nc1nc(N)n(n1)-c1ccccn1)N1CCOCC1