Reaction Details
TargetReceptor-type tyrosine-protein kinase FLT3
LigandBDBM50355468
Substrate/Competitorn/a
Meas. Tech.ChEMBL_806856 (CHEMBL1958984)
IC50 27±n/a nM
Citation Heidary, DKHuang, GBoucher, DMa, JForster, CGrey, RXu, JArnost, MChoquette, DChen, GZhou, JHYao, YMBall, EDNamchuk, MDavies, RJHenkel, G VX-322: a novel dual receptor tyrosine kinase inhibitor for the treatment of acute myelogenous leukemia. J Med Chem55:725-34 (2012) 
 
Receptor-type tyrosine-protein kinase FLT3
Name:Receptor-type tyrosine-protein kinase FLT3
Type:Enzyme
Mol. Mass.:112888.62
Organism:Homo sapiens (Human)
Description:P36888
Residue:993
BDBM50355468
NameBDBM50355468
Synonyms:CHEMBL1835743
TypeSmall organic molecule
Emp. Form.C17H18FN7O
Mol. Mass.355.3695
SMILESNc1nc(Nc2cc(ccc2F)N2CCOCC2)nn1-c1ccccn1