Reaction Details
TargetThymidylate kinase
LigandBDBM50223787
Substrate/Competitorn/a
Meas. Tech.ChEMBL_807092 (CHEMBL1959670)
Ki 1000±n/a nM
Citation Choi, JYPlummer, MSStarr, JDesbonnet, CRSoutter, HChang, JMiller, JRDillman, KMiller, AARoush, WR Structure guided development of novel thymidine mimetics targeting Pseudomonas aeruginosa thymidylate kinase: from hit to lead generation. J Med Chem55:852-70 (2012) 
 
Thymidylate kinase
Name:Thymidylate kinase
Type:PROTEIN
Mol. Mass.:22636.29
Organism:Mycobacterium tuberculosis
Description:ChEMBL_208218
Residue:214
BDBM50223787
NameBDBM50223787
Synonyms:CHEMBL235088 | N-(5'-deoxy-alpha-D-thymidin-5'-yl)-N'-(3,4-dichlorophenyl)thiourea
TypeSmall organic molecule
Emp. Form.C17H18Cl2N4O4S
Mol. Mass.445.32
SMILESCc1cn([C@@H]2C[C@H](O)[C@@H](CNC(=S)Nc3ccc(Cl)c(Cl)c3)O2)c(=O)[nH]c1=O