Reaction Details
TargetGlycogen synthase kinase-3 beta
LigandBDBM50026864
Substrate/Competitorn/a
Meas. Tech.ChEMBL_807282 (CHEMBL1960375)
IC50 3162±n/a nM
Citation Gentile, GMerlo, GPozzan, ABernasconi, GBax, BBamborough, PBridges, ACarter, PNeu, MYao, GBrough, CCutler, GCoffin, ABelyanskaya, S 5-Aryl-4-carboxamide-1,3-oxazoles: potent and selective GSK-3 inhibitors. Bioorg Med Chem Lett22:1989-94 (2012) 
 
Glycogen synthase kinase-3 beta
Name:Glycogen synthase kinase-3 beta
Type:Enzyme
Mol. Mass.:46756.38
Organism:Homo sapiens (Human)
Description:P49841
Residue:420
BDBM50026864
NameBDBM50026864
Synonyms:CHEMBL1957088
TypeSmall organic molecule
Emp. Form.C17H12N4O2
Mol. Mass.304.3028
SMILESO=C(NCc1ccncc1)c1ncoc1-c1ccc(cc1)C#N