Reaction Details
TargetCyclin-dependent kinase 2
LigandBDBM50026861
Substrate/Competitorn/a
Meas. Tech.ChEMBL_807302 (CHEMBL1960395)
IC50 5012±n/a nM
Citation Gentile, GMerlo, GPozzan, ABernasconi, GBax, BBamborough, PBridges, ACarter, PNeu, MYao, GBrough, CCutler, GCoffin, ABelyanskaya, S 5-Aryl-4-carboxamide-1,3-oxazoles: potent and selective GSK-3 inhibitors. Bioorg Med Chem Lett22:1989-94 (2012) 
 
Cyclin-dependent kinase 2
Name:Cyclin-dependent kinase 2
Type:Enzyme Subunit
Mol. Mass.:33938.17
Organism:Homo sapiens (Human)
Description:P24941
Residue:298
BDBM50026861
NameBDBM50026861
Synonyms:CHEMBL1957098
TypeSmall organic molecule
Emp. Form.C16H14N4O3
Mol. Mass.310.3074
SMILESCOc1ccc(cn1)-c1ocnc1C(=O)NCc1ccncc1