Reaction Details
TargetCyclin-dependent kinase 2
LigandBDBM50026849
Substrate/Competitorn/a
Meas. Tech.ChEMBL_807302 (CHEMBL1960395)
IC50 501±n/a nM
Citation Gentile, GMerlo, GPozzan, ABernasconi, GBax, BBamborough, PBridges, ACarter, PNeu, MYao, GBrough, CCutler, GCoffin, ABelyanskaya, S 5-Aryl-4-carboxamide-1,3-oxazoles: potent and selective GSK-3 inhibitors. Bioorg Med Chem Lett22:1989-94 (2012) 
 
Cyclin-dependent kinase 2
Name:Cyclin-dependent kinase 2
Type:Enzyme Subunit
Mol. Mass.:33938.17
Organism:Homo sapiens (Human)
Description:P24941
Residue:298
BDBM50026849
NameBDBM50026849
Synonyms:CHEMBL1957231
TypeSmall organic molecule
Emp. Form.C19H15ClN4O3
Mol. Mass.382.8
SMILESCOc1ccc(cc1Cl)-c1ocnc1C(=O)NCc1ccn2ccnc2c1