Reaction Details
TargetSerine/threonine-protein kinase PAK 1
LigandBDBM50365426
Substrate/Competitorn/a
Meas. Tech.ChEMBL_807294 (CHEMBL1960387)
IC50>10000±n/a nM
Citation Gentile, GMerlo, GPozzan, ABernasconi, GBax, BBamborough, PBridges, ACarter, PNeu, MYao, GBrough, CCutler, GCoffin, ABelyanskaya, S 5-Aryl-4-carboxamide-1,3-oxazoles: potent and selective GSK-3 inhibitors. Bioorg Med Chem Lett22:1989-94 (2012) 
 
Serine/threonine-protein kinase PAK 1
Name:Serine/threonine-protein kinase PAK 1
Type:n/a
Mol. Mass.:60640.15
Organism:Homo sapiens (Human)
Description:Q13153
Residue:545
BDBM50365426
NameBDBM50365426
Synonyms:CHEMBL1957085
TypeSmall organic molecule
Emp. Form.C17H15N3O3
Mol. Mass.309.3193
SMILESCOc1ccc(cc1)-c1ocnc1C(=O)NCc1ccncc1